BDBM338413 (3S,6R)-2-[[2-fluoro-4- (tetrahydropyran-4- ylidenemethyl)phenyl]methyl]-3- methyl-6-phenyl-thiazinane 1,1- dioxide::US9751873, Example 101
SMILES [#6]-[#6@H]-1-[#6]-[#6]-[#6@H](-c2ccccc2)S(=O)(=O)[#7]-1-[#6]-c1ccc(\[#6]=[#6]-2/[#6]-[#6]-[#8]-[#6]-[#6]-2)cc1F
InChI Key InChIKey=ULJSHSYARUCMLF-MHECFPHRSA-N
Data  1 IC50
  Tab Delimited (TSV)   2D SDfile   Computed 3D by Vconf -m prep SDfile
Find this compound or compounds like it in BindingDB:
Activity Spreadsheet -- Enzyme Inhibition Constant Data from BindingDB
Found 1 hit for monomerid = 338413
TargetNuclear receptor ROR-gamma(Homo sapiens (Human))
Genentech
US Patent
LigandPNGBDBM338413((3S,6R)-2-[[2-fluoro-4- (tetrahydropyran-4- yliden...)
Affinity DataIC50:  50nM. Assay description: Assays were carried out in 16-microL reaction volumes in black 384 Plus F Proxiplates (Perkin-Elmer 6008269). All assay components except test ligand...
Ligand InfoPC cidPC sid
In DepthDetails US Patent